{"text_format":"1","workbook":"xlsx","n_sheets":10,"sheets":["画面表示","Status","Set","Element","LoadData","3年後見込","損害率","保険料率","ツール構成","結果_Form"],"not_rendered":{"charts":0,"images":0,"macros":1,"external_links":0,"defined_names":362,"comments":3,"pivot_tables":0},"unopened":[],"bounds":{"document_bytes":16777216,"sheet_cells":100000,"rows_first":2000,"rows_last":500,"rows_between":2000,"halvings":0,"cell_chars":16384,"cell_head_chars":4096},"cells_cut":0,"cells_raw":0,"read":"whole","date_system":"1900"}

{"sheet":"画面表示","index":0,"n_rows":0,"n_cols":0,"rows_kept":0,"cut":false,"hidden":false,"merged":[]}

{"sheet":"Status","index":1,"n_rows":370,"n_cols":10,"rows_kept":370,"cut":false,"hidden":false,"merged":[[0,0,0,7],[1,2,1,5],[2,2,2,5],[3,3,3,5],[5,3,5,5],[6,3,6,5],[54,3,54,4],[55,3,55,4],[56,3,56,4],[57,3,57,4],[58,3,58,4],[59,3,59,4],[44,3,44,5],[46,4,46,5],[47,3,47,5],[48,3,50,4],[51,3,51,5],[53,3,53,4],[66,3,66,4],[67,3,67,4],[68,3,68,4],[69,3,69,4],[70,3,70,4],[71,3,71,4],[60,3,60,4],[61,3,61,4],[62,3,62,4],[63,3,63,4],[64,3,64,4],[65,3,65,4],[78,3,78,4],[79,3,79,4],[80,3,80,4],[81,3,81,4],[82,3,82,4],[83,3,83,4],[72,3,72,4],[73,3,73,4],[74,3,74,4],[75,3,75,4],[76,3,76,4],[77,3,77,4],[90,3,90,4],[91,3,91,4],[92,3,92,4],[93,3,93,4],[94,3,94,4],[95,3,95,4],[84,3,84,4],[85,3,85,4],[86,3,86,4],[87,3,87,4],[88,3,88,4],[89,3,89,4],[102,3,102,4],[103,3,103,4],[104,3,104,4],[105,3,105,4],[106,3,106,4],[107,3,107,4],[96,3,96,4],[97,3,97,4],[98,3,98,4],[99,3,99,4],[100,3,100,4],[101,3,101,4],[114,3,114,4],[115,3,115,4],[116,3,116,4],[117,3,117,4],[118,3,118,4],[119,3,119,4],[108,3,108,4],[109,3,109,4],[110,3,110,4],[111,3,111,4],[112,3,112,4],[113,3,113,4],[126,3,126,4],[127,3,127,4],[128,3,128,4],[129,3,129,4],[130,3,130,4],[131,3,131,4],[120,3,120,4],[121,3,121,4],[122,3,122,4],[123,3,123,4],[124,3,124,4],[125,3,125,4],[138,3,138,4],[139,3,139,4],[140,3,140,4],[141,3,141,4],[142,3,142,4],[143,3,143,4],[132,3,132,4],[133,3,133,4],[134,3,134,4],[135,3,135,4],[136,3,136,4],[137,3,137,4],[150,3,150,4],[151,3,151,4],[152,3,152,4],[153,3,153,4],[154,3,154,4],[155,3,155,4],[144,3,144,4],[145,3,145,4],[146,3,146,4],[147,3,147,4],[148,3,148,4],[149,3,149,4],[162,3,162,4],[163,3,163,4],[164,3,164,4],[165,3,165,4],[166,3,166,4],[167,3,167,4],[156,3,156,4],[157,3,157,4],[158,3,158,4],[159,3,159,4],[160,3,160,4],[161,3,161,4],[174,3,174,4],[175,3,175,4],[176,3,176,4],[177,3,177,4],[178,3,178,4],[179,3,179,4],[168,3,168,4],[169,3,169,4],[170,3,170,4],[171,3,171,4],[172,3,172,4],[173,3,173,4],[186,3,186,4],[187,3,187,4],[188,3,188,4],[189,3,189,4],[190,3,190,4],[191,3,191,4],[180,3,180,4],[181,3,181,4],[182,3,182,4],[183,3,183,4],[184,3,184,4],[185,3,185,4],[198,3,198,4],[199,3,199,4],[200,3,200,4],[201,3,201,4],[202,3,202,4],[203,3,203,4],[192,3,192,4],[193,3,193,4],[194,3,194,4],[195,3,195,4],[196,3,196,4],[197,3,197,4],[210,3,210,4],[211,3,211,4],[212,3,212,4],[213,3,213,4],[214,3,214,4],[215,3,215,4],[204,3,204,4],[205,3,205,4],[206,3,206,4],[207,3,207,4],[208,3,208,4],[209,3,209,4],[222,3,222,4],[223,3,223,4],[224,3,224,4],[225,3,225,4],[226,3,226,4],[227,3,227,4],[216,3,216,4],[217,3,217,4],[218,3,218,4],[219,3,219,4],[220,3,220,4],[221,3,221,4],[234,3,234,4],[235,3,235,4],[236,3,236,4],[237,3,237,4],[238,3,238,4],[239,3,239,4],[228,3,228,4],[229,3,229,4],[230,3,230,4],[231,3,231,4],[232,3,232,4],[233,3,233,4],[246,3,246,4],[247,3,247,4],[248,3,248,4],[249,3,249,4],[250,3,250,4],[251,3,251,4],[240,3,240,4],[241,3,241,4],[242,3,242,4],[243,3,243,4],[244,3,244,4],[245,3,245,4],[258,3,258,4],[259,3,259,4],[260,3,260,4],[261,3,261,4],[262,3,262,4],[263,3,263,4],[252,3,252,4],[253,3,253,4],[254,3,254,4],[255,3,255,4],[256,3,256,4],[257,3,257,4],[270,3,270,4],[271,3,271,4],[272,3,272,4],[273,3,273,4],[274,3,274,4],[275,3,275,4],[264,3,264,4],[265,3,265,4],[266,3,266,4],[267,3,267,4],[268,3,268,4],[269,3,269,4],[282,3,282,4],[283,3,283,4],[284,3,284,4],[285,3,285,4],[286,3,286,4],[287,3,287,4],[276,3,276,4],[277,3,277,4],[278,3,278,4],[279,3,279,4],[280,3,280,4],[281,3,281,4],[294,3,294,4],[295,3,295,4],[296,3,296,4],[297,3,297,4],[298,3,298,4],[299,3,299,4],[288,3,288,4],[289,3,289,4],[290,3,290,4],[291,3,291,4],[292,3,292,4],[293,3,293,4],[306,3,306,4],[307,3,307,4],[308,3,308,4],[309,3,309,4],[310,4,310,5],[311,4,311,5],[300,3,300,4],[301,3,301,4],[302,3,302,4],[303,3,303,4],[304,3,304,4],[305,3,305,4],[320,3,320,4],[321,3,321,4],[322,3,322,4],[323,3,323,4],[324,3,324,4],[325,3,325,4],[313,4,313,5],[314,4,314,5],[316,3,316,4],[317,3,317,4],[318,3,318,4],[319,3,319,4],[332,3,332,4],[333,3,333,4],[334,3,334,4],[335,3,335,4],[336,3,336,4],[337,3,337,4],[326,3,326,4],[327,3,327,4],[328,3,328,4],[329,3,329,4],[330,3,330,4],[331,3,331,4],[344,3,344,4],[345,3,345,4],[346,3,346,4],[347,3,347,4],[348,3,348,4],[349,3,349,4],[338,3,338,4],[339,3,339,4],[340,3,340,4],[341,3,341,4],[342,3,342,4],[343,3,343,4],[362,3,362,4],[356,3,356,4],[357,3,357,4],[358,3,358,4],[359,3,359,4],[360,3,360,4],[361,3,361,4],[350,3,350,4],[351,3,351,4],[352,3,352,4],[353,3,353,4],[354,3,354,4],[355,3,355,4]]}
["Status",null,null,null,null,null,null,null,null,"初期値"]
[null,1,"現在の頁",null,null,null,"Page_Now",1,null,1]
[null,2,"直前の頁",null,null,null,"Page_Before",{"$f":"Page_Now","v":1},null,{"$f":"Page_Now","v":1}]
[null,null,"入力１","保険期間開始年",null,null,"HokenStartY"]
[null,null,null,null,null,null,"StartY"]
[null,null,null,"基準収入金額",null,null,"KijunShunyu"]
[null,null,null,"補てん方式",null,null,"HotenHoshiki"]
[null,null,null,"保険方式","補償限度","９０％","Hoken_HoshoGendo90",false,null,false]
[null,null,null,null,null,"８８％","Hoken_HoshoGendo88",false,null,false]
[null,null,null,null,null,"８５％","Hoken_HoshoGendo85",false,null,false]
{"$rows_left_out":361}
{"sheet":"Set","index":2,"n_rows":817,"n_cols":12,"rows_kept":817,"cut":false,"hidden":false,"merged":[]}
["No","Page","Style","Object","Cell","Group","GroupA","GroupB","InitialVisible","Visible01","Visible02","RestartFLG"]
[1,3,"Label","Lbl3_HokenStartY","HokenStartY",null,null,null,true,"H31-Hoken"]
[{"$f":"A2+1","v":2},3,"Combo","CBx3_HokenStartY","HokenStartY",null,null,3,true,"H31-Hoken",null,3]
[{"$f":"A3+1","v":3},3,"Label","Lbl3_KijunShunyu","KijunShunyu",null,null,null,true,"H31-Hoken"]
[4,3,"Text","TBx3_KijunShunyu","KijunShunyu",null,null,3,true,"H31-Hoken","#,##0",3]
[5,3,"Label","Lbl3_HotenHoshiki","HotenHoshiki",null,null,null,true,"H31-Hoken"]
[6,3,"Combo","CBx3_HotenHoshiki","HotenHoshiki",null,null,3,true,"H31-Hoken",null,3]
[7,3,"Label","Lbl3_Hoken_HoshoGendo","Hoken_HoshoGendo",null,null,null,true,"H31-Hoken"]
[8,3,"Check","CBx3_Hoken_HoshoGendo90","Hoken_HoshoGendo90","Hoken_HoshoGendo",null,"3’",true,"R6-Hoken",null,3]
[9,3,"Check","CBx3_Hoken_HoshoGendo88","Hoken_HoshoGendo88","Hoken_HoshoGendo",null,"3’",true,"R6-Hoken",null,3]
{"$rows_left_out":808}
{"sheet":"Element","index":3,"n_rows":11,"n_cols":24,"rows_kept":11,"cut":false,"hidden":false,"merged":[]}
["縦要素数",{"$f":"COUNTA(A5:A104)","v":5}]
["横要素数",{"$f":"MAX(C5:C104)","v":21}]
[]
[null,null,"要素数",1,2,3,4,5,6,7,8,9,10,11,12,13,14,15,16,17,18,19,20,21]
["CBx3_HokenStartY","HokenStartY",{"$f":"COUNTA(D5:X5)","v":1},"令和  7年"]
["CBx3_HotenHoshiki","HotenHoshiki",{"$f":"COUNTA(D6:X6)","v":2},"保険方式＋積立方式","保険方式のみ"]
["CBx3_KikenDankaiKubun","KikenDankaiKubun",{"$f":"COUNTA(D7:X7)","v":21}," 10区分","  9区分","  8区分","  7区分","  6区分","  5区分","  4区分","  3区分","  2区分","  1区分","  0区分"," -1区分"," -2区分"," -3区分"," -4区分"," -5区分"," -6区分"," -7区分"," -8区分"," -9区分","-10区分"]
["CBx3_GekihenKanwaSochiTekiyo","GekihenKanwaSochiTekiyo",{"$f":"COUNTA(D8:X8)","v":2},"激変緩和措置適用なし","激変緩和措置適用あり"]
["CBx3_MikomiNogyoTaishoHinmoku","MikomiNogyoTaishoHinmoku",{"$f":"COUNTA(D9:X9)","v":11}," 1品目"," 2品目"," 3品目"," 4品目"," 5品目"," 6品目"," 7品目"," 8品目"," 9品目","10品目","11品目以上"]
[]
{"$rows_left_out":2}
{"sheet":"LoadData","index":4,"n_rows":0,"n_cols":0,"rows_kept":0,"cut":false,"hidden":false,"merged":[]}

{"sheet":"3年後見込","index":5,"n_rows":44,"n_cols":22,"rows_kept":44,"cut":false,"hidden":false,"merged":[[42,2,42,8],[9,2,9,10],[15,2,15,9],[21,2,21,8],[30,2,30,10],[36,2,36,9]]}
[null,null,"10年前","9年前","8年前","7年前","6年前","5年前","4年前","3年前","2年前","1年前","計",null,"保険料率","保険限度","補償の下限","危険段階","KEY",null,"標準保険料率","KEY"]
[null,"損害率",100,100,100,100,100,100,100,100,100,100,null,null,{"$f":"VLOOKUP(S2,保険料率!D:E,2,FALSE)","v":2.3570000000000002},{"$f":"Hoken_HoshoGendo","v":80},{"$f":"Hoken_HoshoKagen","v":0},{"$f":"KikenDankai","v":0},{"$f":"TEXT(P2,\"00\")&TEXT(Q2,\"00\")&TEXT(R2+10,\"00\")","v":"800010"},null,{"$f":"VLOOKUP(V2,保険料率!I:J,2,FALSE)","v":2.3570000000000002},{"$f":"TEXT(P2,\"00\")&TEXT(Q2,\"00\")","v":"8000"}]
[null,"ウェイト",10,20,30,40,50,60,70,80,90,100,null,null,"保険料",null,null,null,null,null,"標準保険料"]
[null,"ポイント",{"$f":"C2*C3","v":1000},{"$f":"D2*D3","v":2000},3000,4000,5000,6000,7000,8000,9000,10000,{"$f":"SUM(C4:L4)","v":55000},null,{"$f":"ROUNDUP(ROUNDDOWN(HokenKingaku*O2/100,0)/2,0)","v":0},null,null,null,null,null,{"$f":"ROUNDDOWN(HokenKingaku*U2/100,0)","v":0}]
[]
[]
[null,null,"10年前","9年前","8年前","7年前","6年前","5年前","4年前","3年前","2年前","1年前","計",null,"保険料率","保険限度","補償の下限","危険段階","KEY",null,"標準保険料率","KEY"]
[null,"損害率",null,null,null,null,null,null,null,null,null,{"$f":"ROUNDDOWN(結果_Form!K57/'3年後見込'!U4*100,0)","v":{"$error":"#DIV/0!"}},null,null,{"$f":"VLOOKUP(S8,保険料率!D:E,2,FALSE)","v":{"$error":"#DIV/0!"}},{"$f":"Hoken_HoshoGendo","v":80},{"$f":"Hoken_HoshoKagen","v":0},{"$f":"損害率!D27","v":{"$error":"#DIV/0!"}},{"$f":"TEXT(P8,\"00\")&TEXT(Q8,\"00\")&TEXT(R8+10,\"00\")","v":{"$error":"#DIV/0!"}},null,{"$f":"VLOOKUP(V8,保険料率!I:J,2,FALSE)","v":2.3570000000000002},{"$f":"TEXT(P8,\"00\")&TEXT(Q8,\"00\")","v":"8000"}]
[null,"ウェイト",null,null,null,null,null,null,null,null,null,{"$f":"L3","v":100},null,null,"保険料","標準保険料",null,null,null,null,"標準保険料"]
[null,"ポイント",{"$f":"IF(KajuHeikinSongairitsuKiso1>0,KajuHeikinSongairitsuKiso1,SUM(C4:K4))","v":45000},null,null,null,null,null,null,null,null,{"$f":"L8*L9","v":{"$error":"#DIV/0!"}},{"$f":"SUM(C10:L10)","v":{"$error":"#DIV/0!"}},null,{"$f":"ROUNDUP(ROUNDDOWN(HokenKingaku*O8/100,0)/2,0)","v":{"$error":"#DIV/0!"}},{"$f":"ROUNDDOWN(HokenKingaku*O8/100,0)","v":{"$error":"#DIV/0!"}},null,null,null,null,{"$f":"ROUNDDOWN(HokenKingaku*U8/100,0)","v":0}]
{"$rows_left_out":35}
{"sheet":"損害率","index":6,"n_rows":29,"n_cols":14,"rows_kept":29,"cut":false,"hidden":false,"merged":[[0,9,0,10],[0,11,1,11],[0,12,1,12],[0,13,1,13],[23,0,23,2],[23,8,23,10],[0,0,1,0],[0,1,0,2],[0,3,1,3],[0,4,1,4],[0,5,1,5],[0,8,1,8],[26,0,26,1],[26,8,26,9],[27,0,27,1],[27,8,27,9],[28,0,28,2],[28,8,28,10]]}
["危険段階区分","加重平均損害率",null,"1年後","2年後","3年後",null,null,"危険段階区分","加重平均損害率",null,"1年後","2年後","3年後"]
[null,"　上限　","　下限　",null,null,null,null,null,null,"　上限　","　下限　"]
[10,null,195,{"$f":"IF('3年後見込'!$M$11>=損害率!$C3,A3,0)","v":{"$error":"#DIV/0!"}},{"$f":"IF('3年後見込'!$M$17>=損害率!$C3,A3,0)","v":{"$error":"#DIV/0!"}},{"$f":"IF('3年後見込'!$M$23>=損害率!$C3,A3,0)","v":{"$error":"#DIV/0!"}},null,null,10,null,195,{"$f":"IF('3年後見込'!$M$32>=損害率!$C3,I3,0)","v":{"$error":"#DIV/0!"}},{"$f":"IF('3年後見込'!$M$38>=損害率!$C3,I3,0)","v":{"$error":"#DIV/0!"}},{"$f":"IF('3年後見込'!$M$44>=損害率!$C3,I3,0)","v":{"$error":"#DIV/0!"}}]
[9,195,185,{"$f":"IF(AND(損害率!$B4>'3年後見込'!$M$11,'3年後見込'!$M$11>=損害率!$C4),A4,0)","v":{"$error":"#DIV/0!"}},{"$f":"IF(AND(損害率!$B4>'3年後見込'!$M$17,'3年後見込'!$M$17>=損害率!$C4),A4,0)","v":{"$error":"#DIV/0!"}},{"$f":"IF(AND(損害率!$B4>'3年後見込'!$M$23,'3年後見込'!$M$23>=損害率!$C4),A4,0)","v":{"$error":"#DIV/0!"}},null,null,9,195,185,{"$f":"IF(AND(損害率!$B4>'3年後見込'!$M$32,'3年後見込'!$M$32>=損害率!$C4),I4,0)","v":{"$error":"#DIV/0!"}},{"$f":"IF(AND(損害率!$B4>'3年後見込'!$M$38,'3年後見込'!$M$38>=損害率!$C4),I4,0)","v":{"$error":"#DIV/0!"}},{"$f":"IF(AND(損害率!$B4>'3年後見込'!$M$44,'3年後見込'!$M$44>=損害率!$C4),I4,0)","v":{"$error":"#DIV/0!"}}]
[8,185,175,{"$f":"IF(AND(損害率!$B5>'3年後見込'!$M$11,'3年後見込'!$M$11>=損害率!$C5),A5,0)","v":{"$error":"#DIV/0!"}},{"$f":"IF(AND(損害率!$B5>'3年後見込'!$M$17,'3年後見込'!$M$17>=損害率!$C5),A5,0)","v":{"$error":"#DIV/0!"}},{"$f":"IF(AND(損害率!$B5>'3年後見込'!$M$23,'3年後見込'!$M$23>=損害率!$C5),A5,0)","v":{"$error":"#DIV/0!"}},null,null,8,185,175,{"$f":"IF(AND(損害率!$B5>'3年後見込'!$M$32,'3年後見込'!$M$32>=損害率!$C5),I5,0)","v":{"$error":"#DIV/0!"}},{"$f":"IF(AND(損害率!$B5>'3年後見込'!$M$38,'3年後見込'!$M$38>=損害率!$C5),I5,0)","v":{"$error":"#DIV/0!"}},{"$f":"IF(AND(損害率!$B5>'3年後見込'!$M$44,'3年後見込'!$M$44>=損害率!$C5),I5,0)","v":{"$error":"#DIV/0!"}}]
[7,175,165,{"$f":"IF(AND(損害率!$B6>'3年後見込'!$M$11,'3年後見込'!$M$11>=損害率!$C6),A6,0)","v":{"$error":"#DIV/0!"}},{"$f":"IF(AND(損害率!$B6>'3年後見込'!$M$17,'3年後見込'!$M$17>=損害率!$C6),A6,0)","v":{"$error":"#DIV/0!"}},{"$f":"IF(AND(損害率!$B6>'3年後見込'!$M$23,'3年後見込'!$M$23>=損害率!$C6),A6,0)","v":{"$error":"#DIV/0!"}},null,null,7,175,165,{"$f":"IF(AND(損害率!$B6>'3年後見込'!$M$32,'3年後見込'!$M$32>=損害率!$C6),I6,0)","v":{"$error":"#DIV/0!"}},{"$f":"IF(AND(損害率!$B6>'3年後見込'!$M$38,'3年後見込'!$M$38>=損害率!$C6),I6,0)","v":{"$error":"#DIV/0!"}},{"$f":"IF(AND(損害率!$B6>'3年後見込'!$M$44,'3年後見込'!$M$44>=損害率!$C6),I6,0)","v":{"$error":"#DIV/0!"}}]
[6,165,155,{"$f":"IF(AND(損害率!$B7>'3年後見込'!$M$11,'3年後見込'!$M$11>=損害率!$C7),A7,0)","v":{"$error":"#DIV/0!"}},{"$f":"IF(AND(損害率!$B7>'3年後見込'!$M$17,'3年後見込'!$M$17>=損害率!$C7),A7,0)","v":{"$error":"#DIV/0!"}},{"$f":"IF(AND(損害率!$B7>'3年後見込'!$M$23,'3年後見込'!$M$23>=損害率!$C7),A7,0)","v":{"$error":"#DIV/0!"}},null,null,6,165,155,{"$f":"IF(AND(損害率!$B7>'3年後見込'!$M$32,'3年後見込'!$M$32>=損害率!$C7),I7,0)","v":{"$error":"#DIV/0!"}},{"$f":"IF(AND(損害率!$B7>'3年後見込'!$M$38,'3年後見込'!$M$38>=損害率!$C7),I7,0)","v":{"$error":"#DIV/0!"}},{"$f":"IF(AND(損害率!$B7>'3年後見込'!$M$44,'3年後見込'!$M$44>=損害率!$C7),I7,0)","v":{"$error":"#DIV/0!"}}]
[5,155,145,{"$f":"IF(AND(損害率!$B8>'3年後見込'!$M$11,'3年後見込'!$M$11>=損害率!$C8),A8,0)","v":{"$error":"#DIV/0!"}},{"$f":"IF(AND(損害率!$B8>'3年後見込'!$M$17,'3年後見込'!$M$17>=損害率!$C8),A8,0)","v":{"$error":"#DIV/0!"}},{"$f":"IF(AND(損害率!$B8>'3年後見込'!$M$23,'3年後見込'!$M$23>=損害率!$C8),A8,0)","v":{"$error":"#DIV/0!"}},null,null,5,155,145,{"$f":"IF(AND(損害率!$B8>'3年後見込'!$M$32,'3年後見込'!$M$32>=損害率!$C8),I8,0)","v":{"$error":"#DIV/0!"}},{"$f":"IF(AND(損害率!$B8>'3年後見込'!$M$38,'3年後見込'!$M$38>=損害率!$C8),I8,0)","v":{"$error":"#DIV/0!"}},{"$f":"IF(AND(損害率!$B8>'3年後見込'!$M$44,'3年後見込'!$M$44>=損害率!$C8),I8,0)","v":{"$error":"#DIV/0!"}}]
[4,145,135,{"$f":"IF(AND(損害率!$B9>'3年後見込'!$M$11,'3年後見込'!$M$11>=損害率!$C9),A9,0)","v":{"$error":"#DIV/0!"}},{"$f":"IF(AND(損害率!$B9>'3年後見込'!$M$17,'3年後見込'!$M$17>=損害率!$C9),A9,0)","v":{"$error":"#DIV/0!"}},{"$f":"IF(AND(損害率!$B9>'3年後見込'!$M$23,'3年後見込'!$M$23>=損害率!$C9),A9,0)","v":{"$error":"#DIV/0!"}},null,null,4,145,135,{"$f":"IF(AND(損害率!$B9>'3年後見込'!$M$32,'3年後見込'!$M$32>=損害率!$C9),I9,0)","v":{"$error":"#DIV/0!"}},{"$f":"IF(AND(損害率!$B9>'3年後見込'!$M$38,'3年後見込'!$M$38>=損害率!$C9),I9,0)","v":{"$error":"#DIV/0!"}},{"$f":"IF(AND(損害率!$B9>'3年後見込'!$M$44,'3年後見込'!$M$44>=損害率!$C9),I9,0)","v":{"$error":"#DIV/0!"}}]
[3,135,125,{"$f":"IF(AND(損害率!$B10>'3年後見込'!$M$11,'3年後見込'!$M$11>=損害率!$C10),A10,0)","v":{"$error":"#DIV/0!"}},{"$f":"IF(AND(損害率!$B10>'3年後見込'!$M$17,'3年後見込'!$M$17>=損害率!$C10),A10,0)","v":{"$error":"#DIV/0!"}},{"$f":"IF(AND(損害率!$B10>'3年後見込'!$M$23,'3年後見込'!$M$23>=損害率!$C10),A10,0)","v":{"$error":"#DIV/0!"}},null,null,3,135,125,{"$f":"IF(AND(損害率!$B10>'3年後見込'!$M$32,'3年後見込'!$M$32>=損害率!$C10),I10,0)","v":{"$error":"#DIV/0!"}},{"$f":"IF(AND(損害率!$B10>'3年後見込'!$M$38,'3年後見込'!$M$38>=損害率!$C10),I10,0)","v":{"$error":"#DIV/0!"}},{"$f":"IF(AND(損害率!$B10>'3年後見込'!$M$44,'3年後見込'!$M$44>=損害率!$C10),I10,0)","v":{"$error":"#DIV/0!"}}]
{"$rows_left_out":20}
{"sheet":"保険料率","index":7,"n_rows":820,"n_cols":12,"rows_kept":820,"cut":false,"hidden":false,"merged":[]}
["保険限度","補償の下限","危険段階","KEY","危険段階別保険料率",null,"保険限度","補償の下限","KEY","保険料標準率",null,"2024/12/03更新"]
[90,0,10,{"$f":"TEXT(A2,\"00\")&TEXT(B2,\"00\")&TEXT(C2+10,\"00\")","v":"900020"},9.3219999999999992,null,90,0,{"$f":"TEXT(G2,\"00\")&TEXT(H2,\"00\")","v":"9000"},4.37]
[90,0,9,"900019",6.2990000000000004,null,90,50,"9050",4.173]
[90,0,8,"900018",6.085,null,90,60,"9060",3.944]
[90,0,7,"900017",5.8710000000000004,null,90,70,"9070",3.4630000000000001]
[90,0,6,"900016",5.6559999999999997,null,88,0,"8800",3.8650000000000002]
[90,0,5,"900015",5.4420000000000002,null,88,50,"8850",3.661]
[90,0,4,"900014",5.2279999999999998,null,88,60,"8860",3.4260000000000002]
[90,0,3,"900013",5.0129999999999999,null,88,70,"8870",2.931]
[90,0,2,"900012",4.7990000000000004,null,85,0,"8500",3.2109999999999999]
{"$rows_left_out":811}
{"sheet":"ツール構成","index":8,"n_rows":132,"n_cols":25,"rows_kept":132,"cut":false,"hidden":false,"merged":[[4,1,4,24],[5,1,5,6],[5,7,5,12],[5,13,5,18],[5,19,5,24],[6,1,6,6],[6,7,6,12],[6,13,6,18],[6,19,6,24],[15,20,15,24],[20,1,20,24],[21,1,21,6],[21,13,21,18],[21,19,21,24],[22,1,22,6],[22,13,22,18],[22,19,22,24],[7,8,7,12],[12,1,12,24],[13,1,13,6],[13,19,13,24],[14,1,14,6],[14,19,14,24],[30,1,30,6],[30,7,30,12],[30,13,30,18],[30,19,30,24],[31,2,31,6],[31,8,31,12],[31,14,31,18],[31,20,31,24],[23,14,23,18],[23,20,23,24],[28,1,28,24],[29,1,29,6],[29,7,29,12],[29,13,29,18],[29,19,29,24],[36,1,36,24],[37,1,37,6],[37,7,37,12],[37,13,37,18],[37,19,37,24],[38,1,38,6],[38,7,38,12],[38,13,38,18],[38,19,38,24],[46,1,46,6],[46,7,46,12],[46,13,46,18],[46,19,46,24],[47,8,47,12],[47,14,47,18],[47,20,47,24],[39,14,39,18],[39,20,39,24],[44,1,44,24],[45,1,45,6],[45,7,45,12],[45,13,45,18],[45,19,45,24],[52,1,52,24],[53,1,53,6],[53,7,53,12],[53,13,53,18],[53,19,53,24],[54,1,54,6],[54,7,54,12],[54,13,54,18],[54,19,54,24],[62,1,62,6],[62,7,62,12],[62,13,62,18],[62,19,62,24],[63,8,63,12],[63,14,63,18],[63,20,63,24],[55,8,55,12],[55,14,55,18],[55,20,55,24],[60,1,60,24],[61,1,61,6],[61,7,61,12],[61,13,61,18],[61,19,61,24],[68,1,68,24],[69,1,69,6],[69,7,69,12],[69,13,69,18],[69,19,69,24],[70,1,70,6],[70,7,70,12],[70,13,70,18],[70,19,70,24],[78,1,78,6],[78,7,78,12],[78,13,78,18],[78,19,78,24],[79,8,79,12],[79,14,79,18],[79,20,79,24],[71,8,71,12],[71,14,71,18],[71,20,71,24],[76,1,76,24],[77,1,77,6],[77,7,77,12],[77,13,77,18],[77,19,77,24],[84,14,84,18],[84,20,84,24],[89,1,89,24],[90,1,90,6],[90,7,90,12],[90,13,90,18],[90,19,90,24],[82,7,82,12],[82,13,82,18],[82,19,82,24],[83,7,83,12],[83,13,83,18],[83,19,83,24],[96,1,96,24],[97,1,97,6],[97,19,97,24],[98,1,98,6],[98,19,98,24],[99,20,99,24],[91,1,91,6],[91,7,91,12],[91,13,91,18],[91,19,91,24],[92,2,92,6],[92,14,92,18],[92,20,92,24],[114,1,114,6],[114,7,114,12],[114,19,114,24],[115,8,115,12],[115,20,115,24],[120,1,120,24],[104,1,104,24],[105,19,105,24],[106,19,106,24],[107,20,107,24],[112,1,112,24],[113,1,113,6],[113,7,113,12],[113,19,113,24],[129,19,129,24],[130,19,130,24],[131,20,131,24],[121,1,121,6],[121,19,121,24],[122,1,122,6],[122,19,122,24],[123,20,123,24],[128,1,128,24]]}
["モジュール構成"]
["V6時点"]
[]
[]
[null,"Page_1（開始）"]
[null,"新規",null,null,null,null,null,"読み込み",null,null,null,null,null,"保険料率更新",null,null,null,null,null,"終了"]
[null,"Btn1_Start_Click",null,null,null,null,null,"Btn1_ReStart_Click",null,null,null,null,null,"Btn1_Koushin_Click",null,null,null,null,null,"Btn1_Quit_Click"]
[null,null,null,null,null,null,null,null,"→Page_14（再開読込）",null,null,null,null,null,null,null,null,null,"※画面移動なし",null,null,null,null,null,"プログラム終了"]
[]
[]
{"$rows_left_out":123}
{"sheet":"結果_Form","index":9,"n_rows":100,"n_cols":35,"rows_kept":100,"cut":false,"hidden":false,"merged":[[0,0,0,34],[1,0,2,13],[1,30,1,34],[3,0,5,0],[3,1,5,5],[3,6,3,8],[3,9,3,11],[3,12,3,14],[3,15,3,21],[3,22,3,26],[3,27,3,30],[3,31,3,34],[4,6,5,8],[4,9,5,11],[4,12,5,14],[4,15,5,21],[4,22,5,26],[4,27,5,30],[4,31,5,34],[6,22,7,26],[6,27,7,30],[6,31,7,34],[9,0,11,0],[9,1,11,5],[9,6,10,8],[9,9,10,11],[9,12,10,14],[9,15,10,21],[9,22,10,26],[6,0,8,0],[6,1,8,5],[6,6,7,8],[6,9,7,11],[6,12,7,14],[6,15,7,21],[9,27,10,30],[9,31,10,34],[12,0,14,0],[12,1,14,5],[12,6,13,8],[12,9,13,11],[12,12,13,14],[12,15,13,21],[12,22,13,26],[12,27,13,30],[12,31,13,34],[15,0,17,0],[15,1,17,5],[15,6,16,8],[15,9,16,11],[15,12,16,14],[15,15,16,21],[15,22,16,26],[15,27,16,30],[15,31,16,34],[18,22,19,26],[18,27,19,30],[18,31,19,34],[21,0,23,0],[21,1,23,5],[21,6,22,8],[21,9,22,11],[21,12,22,14],[21,15,22,21],[21,22,22,26],[18,0,20,0],[18,1,20,5],[18,6,19,8],[18,9,19,11],[18,12,19,14],[18,15,19,21],[21,27,22,30],[21,31,22,34],[24,0,26,0],[24,1,26,5],[24,6,25,8],[24,9,25,11],[24,12,25,14],[24,15,25,21],[24,22,25,26],[24,27,25,30],[24,31,25,34],[27,0,29,0],[27,1,29,5],[27,6,28,8],[27,9,28,11],[27,12,28,14],[27,15,28,21],[27,22,28,26],[27,27,28,30],[27,31,28,34],[30,22,31,26],[30,27,31,30],[30,31,31,34],[33,0,35,0],[33,1,35,5],[33,6,34,8],[33,9,34,11],[33,12,34,14],[33,15,34,21],[33,22,34,26],[30,0,32,0],[30,1,32,5],[30,6,31,8],[30,9,31,11],[30,12,31,14],[30,15,31,21],[36,31,37,34],[44,3,44,8],[44,10,44,14],[45,3,45,8],[45,10,45,14],[46,10,46,14],[33,27,34,30],[33,31,34,34],[36,0,38,0],[36,1,38,5],[36,6,37,8],[36,9,37,11],[36,12,37,14],[36,15,37,21],[36,22,37,26],[36,27,37,30],[57,3,57,8],[57,10,57,14],[58,10,58,14],[59,10,59,14],[60,3,60,8],[60,10,60,14],[47,10,47,14],[51,3,51,9],[51,10,51,14],[52,3,52,9],[52,10,52,14],[56,3,56,8],[56,10,56,14],[60,20,61,28],[61,3,61,6],[61,7,61,9],[61,10,61,14],[68,2,69,4],[71,7,71,11],[71,13,71,15],[71,16,71,21],[71,22,71,24],[71,25,71,28],[71,29,71,34],[73,16,73,21],[73,22,73,24],[73,25,73,28],[73,29,73,34],[75,16,75,21],[75,22,75,24],[75,25,75,28],[75,29,75,34],[77,13,77,15],[77,16,77,21],[77,22,77,24],[77,25,77,28],[77,29,77,34],[79,16,79,21],[79,22,79,24],[79,25,79,28],[79,29,79,34],[88,9,88,14],[88,28,88,33],[89,10,89,14],[89,29,89,33],[90,9,90,14],[90,28,90,33],[82,2,83,7],[82,19,83,27],[85,2,85,9],[85,10,85,14],[85,29,85,33],[87,2,87,9],[87,10,87,14],[87,29,87,33],[97,10,97,14],[97,29,97,33],[99,5,99,14],[91,10,91,14],[91,29,91,33],[93,10,93,14],[93,29,93,33],[94,5,94,14],[95,2,95,9],[95,10,95,14],[95,29,95,33]]}
["「農業経営収入保険　保険金等見積額算出ツール」 出力結果"]
[null,null,null,null,null,null,null,null,null,null,null,null,null,null,null,null,null,null,null,null,null,null,null,null,null,null,null,null,null,null,{"$f":"TODAY()","v":"2025-11-12"}]
[]
["明細","種類・品目等",null,null,null,null,"期首棚卸高",null,null,"販売金額",null,null,"事業消費金額",null,null,"期末棚卸高",null,null,null,null,null,null,"農業収入金額",null,null,null,null,"見込農業収入金額",null,null,null,"農業収入増減額"]
[null,null,null,null,null,null,"①",null,null,"②",null,null,"③",null,null,"④",null,null,null,null,null,null,"⑤=②＋③＋④－①",null,null,null,null,"⑥",null,null,null,"⑦=⑤－⑥"]
[]
["０１",{"$f":"IF(ShuruiHinmoku1<>\"\",ShuruiHinmoku1,\"\")","v":""},null,null,null,null,{"$f":"KishuTanaoroshi1","v":0},null,null,{"$f":"ShunyuKingakuShinkoku1","v":0},null,null,{"$f":"JigyoShohiKingaku1","v":0},null,null,{"$f":"KimatsuTanaoroshiKingaku1","v":0},null,null,null,null,null,null,{"$f":"NogyoShunyuKingaku1","v":0},null,null,null,null,{"$f":"MikomiNogyoShunyu1","v":0},null,null,null,{"$f":"NogyoShunyuZogengaku1","v":0}]
[]
[null,null,null,null,null,null,null,null,"円",null,null,"円",null,null,"円",null,null,null,null,null,null,"円",null,null,null,null,"円",null,null,null,"円",null,null,null,"円"]
[{"$f":"IF(MikomiNogyoTaishoHinmoku2>=2,\"０２\",\"\")","v":{"$error":"#VALUE!"}},{"$f":"IF(ShuruiHinmoku2<>\"\",ShuruiHinmoku2,\"\")","v":""},null,null,null,null,{"$f":"IF(MikomiNogyoTaishoHinmoku2>=2,KishuTanaoroshi2,\"\")","v":{"$error":"#VALUE!"}},null,null,{"$f":"IF(MikomiNogyoTaishoHinmoku2>=2,ShunyuKingakuShinkoku2,\"\")","v":{"$error":"#VALUE!"}},null,null,{"$f":"IF(MikomiNogyoTaishoHinmoku2>=2,JigyoShohiKingaku2,\"\")","v":{"$error":"#VALUE!"}},null,null,{"$f":"IF(MikomiNogyoTaishoHinmoku2>=2,KimatsuTanaoroshiKingaku2,\"\")","v":{"$error":"#VALUE!"}},null,null,null,null,null,null,{"$f":"IF(MikomiNogyoTaishoHinmoku2>=2,NogyoShunyuKingaku2,\"\")","v":{"$error":"#VALUE!"}},null,null,null,null,{"$f":"IF(MikomiNogyoTaishoHinmoku2>=2,MikomiNogyoShunyu2,\"\")","v":{"$error":"#VALUE!"}},null,null,null,{"$f":"IF(MikomiNogyoTaishoHinmoku2>=2,NogyoShunyuZogengaku2,\"\")","v":{"$error":"#VALUE!"}}]
{"$rows_left_out":90}